Gcc Error Undeclared First Use In This Function

Complete Solution Is In The Short TUTORIAL

RECOMMENDED: If you have Windows errors then we strongly recommend that you download and run this (Windows) Repair Tool.

First spotted at Computex 2017, ASRock’s new Ryzen Threadripper-compatible X399 Taichi is now available for pre-order. including certain storage device functions, may be disabled when doing BCLK overclocking. Beyond that, this.

@mbaitof: Not true; VC++ supports C compilation, and will use C compilation automatically for source files with a.c extension. Just because the IDE does not offer.c.

The Sp1 transcription factor binds to the G-allele of the –1087 IL-10 gene polymorphism and enhances transcriptional activation – To our knowledge, this is the first. GCC haplotype of the IL-10 promoter through this site. In conclusion, this study.

Error Code 1624 Jun 4, 2015. CustomAction VM_InstallJRE returned actual error code 1624. 2 Replies. vCenter Server 5.5 Update 2e contains fix of

You can use this variable in commands that perform an action on every object or on selected objects in a pipeline. Contains an array of the undeclared parameters and/or parameter values that are passed to a function. recent.

First, Doha continues to support. and much to the chagrin of the rest of the GCC, the Qatari government is continuing to support all vestiges of the Ikhwan. Ikhwan institutions continue to function in Doha including associations and.

C variable undeclared (first use in function). Here is the Error Log: gcc -g -Wall assign1.c main. 'actual_ouput' undeclared (first use in this function).

Common gcc error messages. conepainting.c:30: error: 'KInchesPerFoot' undeclared (first use in this.h function prototype has different number of.

I am working on the ‘driver’ part of my programing assignment and i keep getting this absurd error: error C2065: ‘cout’ : undeclared identifier I have even tried.

Mark Joseph Stern Mark Joseph Stern is a writer for Slate. He covers the law and LGBTQ issues. First up: On Saturday. she is notified and has an opportunity to fix the error.) Advertisement Two Democratic groups challenged the Florida.

Sorry for not adding this into my first reply, but how do you deallocate each item in the array if you do not know the size of the array?

Ibm Error Code 0518 Lookup area code 404 details: major cities and timezone. View the 404 area code map in Georgia. Find the name

cphillip1.c:11: error: `pid' undeclared (first use in this function) cphillip1.c:15: error : `my_pid' undeclared (first use in this function) cphillip1.c:29:7: warning: no newline at end of file. I'm guessing that the include path cannot be found. I use gcc to compile. how can I set the class path so that gcc knows where.

Etabs Error 10 http://backspacetab.com While installing a program on your computer, Windows Installer may abort the active installation and show you error1722 with

Jan 15, 2015. actual_output is undeclared even though it obviously declared in the function. The error comes at the line when the variable is being assigned to the return value of byte_sort, which is defined in another c file, assign1.c , but has a forward declaration in assign1.h file. I'm using gcc -g -Wall assign1.c main.c.

GCC unable to find "errno" when compiling on Ubuntu. 'errno' undeclared (first use in this function). error: (Each undeclared identifier is reported only once

C compilation errors: undeclared (first use in this. The first error; i2cset.c: In function 'check_funcs. with gcc there is a set of predefined directories.

Re: error: 'string' undeclared (first use in this function). From: Axel Freyn <axel- freyn at gmx dot de>; To: gcc-help at gcc dot gnu dot org; Date: Wed, 14 Oct 2009 14:59:21 +0200; Subject: Re: error: 'string' undeclared (first use in this function); References: <[email protected]>.

RECOMMENDED: Click here to fix Windows errors and improve system performance