Error While Loading Shared Libraries Libx11.so.6

How to install mcpelauncher-linux

RECOMMENDED: If you have Windows errors then we strongly recommend that you download and run this (Windows) Repair Tool.

Maya failed to launch with the following error in your terminal window running Linux 64bit: /usr/autodesk/maya2008-x64/bin/maya.bin: error while loading shared.

Mar 03, 2004  · error while loading shared libraries: libX11.so.6 cannot open shared object file: no such file or directory. error while loading shared libraries:.

I’m trying to get peazip running but I’m facing some trouble. When I run peazip I get the error: peazip: error while loading shared libraries: libX11.so.6: cannot.

Http Error 505 Http Version The HTTP requests to a specific API from different clients are. The results were. 5×× Server Error. 505 HTTP Version

Dec 10, 2013. I'm trying to get peazip running but I'm facing some trouble. When I run peazip I get the error: peazip: error while loading shared libraries: libX11.so.6: cannot open shared object file: No such file or directory. From what I searched, I need to install emul-linux-x86-compat and emul-linux-x86-gtklibs. However.

[SOLVED] Head Over Heels – missing libX11.so.6 –. -./HoH: error while loading shared libraries: libX11.so.6: cannot open shared object file: No such file. Head Over Heels – missing libX11.so.6 ?

Feb 13, 2014. nw: error while loading shared libraries: libX11.so.6: cannot open shared object file: No such file or directory. (see that Travis CI log, line 1736). On the same system, when I download https://s3.amazonaws.com/node-webkit/v0.8.4/node- webkit-v0.8.4-linux-x64.tar.gz and unpack it, and then run nw , it runs.

Sep 14, 2011. a script i have this error: "/opt/grads-2.0.a9/bin/grads: error while loading shared libraries: libX11.so.6: cannot open shared object file: No such file or directory" whereas libX11.so.6 exists, when i do a locate libX11 i have this result: /usr/lib/libX11.so.6 /usr/lib/libX11.so.6.3.0 I don't understand this problem,

I'm trying to get peazip running but I'm facing some trouble. When I run peazip I get the error: peazip: error while loading shared libraries: libX11.so.6: cannot.

Jan 16, 2014. HoH: error while loading shared libraries: libX11.so.6: cannot open shared object file: No such file or directory. A quick search on the net shows that libX11.so.6 is in the package libX11-6, however apt-get install libX11-6 returns with libx11-6 is already the newest version. So I already have the library that's.

Creating a symbolic link to /usr/lib/libfreetype.so.6 should not be applied if the error was thrown by a 32-bit. error while loading shared libraries:.

Oct 01, 2012  · . Error while loading shared libraries: libSM.so.6. libX11.so.6 => /usr/lib32/libX11.so.6. error while loading shared libraries:.

Not loading gdm;"libX11.so.6 cannot open shared object" – Not loading X;"libX11.so.6 cannot open shared object" Hi. I'm working with a Knoppix 3.3 hdinstall (with gnome 2.4). error while loading shared libraries:.

[SOLVED]error while loading shared libraries: libX11-xcb.so.1. – I am using Ubuntu 10.04 LTS , I am trying to install QT 5.5 (qt-opensource-linux- x86-5.5.0.run). I used following command to install QT. chmod +x qt-opensource- linux-x86-5.5.0.run./qt-opensource-linux-x86-5.5.0.run. First command ran successfully But got error for second command.

Ora-12012 Error On Auto Execute Of Job 4002 Frigidaire Galary Series Front Load Washer Error Codes Export-mailbox Error Approving Object Sep 15, 2014. VERBOSE: Import-Mailbox : [information] Logging

RECOMMENDED: Click here to fix Windows errors and improve system performance