Error C2449 Found At File Scope

RECOMMENDED: If you have Windows errors then we strongly recommend that you download and run this (Windows) Repair Tool.

Found bugs. These are some of the bugs that we've found with cppcheck. Multiple files: Fix memory leaks on error · Source/cmFileCommand.cxx: Fix file descriptor leak on error. Unitialized variable, possibly array out of index, reduce variable scope · Fix a typo in a comparison · initialize var in the constructor, reduce.

Windows Azure – Fixed an issue that caused Azure AD Connect upgrade to fail with error "Unable to upgrade the Synchronization. To enable this change, the definition of the cloudSOAExchMailbox attribute, which is found under out-of-box sync rule “In.

An open brace occurs at file scope. This error can be caused by a semicolon between a function header. // C2449

Revelations of the breach follow news broken yesterday by Poets and Quants that.

The FBI said it doesn’t know the scope of the problem. In 1997, an internal.

I am using Visual Studio 2010 Express and I am getting the following errors for the file. error : ';' test.h(4): error C2449: found '{' at file scope (missing.

Thomson says more charities are also posting their audited financial statements.

found itself squarely in the crosshairs. This includes switching off detailed error messages, restricting file and directory permissions, and deleting source code.

Compiler Error C2449. 11/04/2016 2 minutes to read Contributors. In this article. found '{' at file scope (missing function header?) An open brace occurs at file scope.

348 matches. the uncertainty in this quantity is included in the above systematic error. We also discuss the large and highly. Miras requires a long-term monitoring programme , we have found that it is a powerful tool for. variables are listed in one text file and each line includes the ID number, the modified Julian date.

Stanford University server – “But they failed to understand the scope of the exposure and did not report it to the GSB dean or relevant university offices for further investigation.” Separately The.

error C2449 and error. error C2449: found '{' at file scope. "This question was caused by a problem that can no longer be reproduced or a simple typographical.

Expedition Error Code P1451 Nov 18, 2015. Trouble Code, Fault Location, Probable Cause. P0308, Cylinder 8 -misfire detected, Engine mechanical fault, wiring, ignition/fuel system,

I’ve created a C++ project where I use C and C++ codes and have some problems with headers. OK, I have 3 codes: basicOCR.cpp #include <stdio.h> #include <.

UDF compilation error solved — CFD Online Discussion Forums – UDF compilation error solved #1:. error C2449: found '{' at file scope. fatal error C1004: unexpected end-of-file found

error C2449 and C1004, please , i need the feedback as soon as possible, udf_names.c(6) : error C2449: found '{' at file scope (missing function header?)

Compiling. c5.c c5.c(5) : error C2061: syntax error : identifier 'Float' c5.c(5) : error C2059: syntax error : ';' c5.c(7) : error C2143: syntax error : missing ';' before '{' c5. c(7) : error C2449: found '{' at file scope (missing function header?) c5.c(8) : error C2015: too many characters in constant c5.c(14) : error C2059: syntax error : '}'.

The Replication Generated An Error 8453 Replication Access Was Denied replication error in AD 8453. Replication access was denied. microsoft.com/en-us/library/replication-error-8453-replication-access-was-denied. 21 ago. 2013. Por algum motivo um dos controladores de

RECOMMENDED: Click here to fix Windows errors and improve system performance